{"text_format":"1","workbook":"xlsx","n_sheets":5,"sheets":["QQT","Simulation","Price List","Config. Data","Tabella"],"not_rendered":{"charts":0,"images":12,"macros":1,"external_links":0,"defined_names":0,"comments":0,"pivot_tables":0},"unopened":[],"bounds":{"document_bytes":16777216,"sheet_cells":100000,"rows_first":2000,"rows_last":500,"rows_between":2000,"halvings":0,"cell_chars":16384,"cell_head_chars":4096},"cells_cut":0,"cells_raw":0,"read":"whole","date_system":"1900"}

{"sheet":"QQT","index":0,"n_rows":40,"n_cols":4,"rows_kept":40,"cut":false,"hidden":false,"merged":[[1,1,3,2],[37,1,37,2],[38,1,38,2],[39,1,39,2],[9,1,9,2],[5,1,7,2]]}
[]
[]
[]
[]
[]
[null,"Quick Configuration Tool"]
[]
[]
[]
[null,"Please fill out all the required following fields:"]
[]
["\"L\" is the maximum dimension",{"$f":"'Config. Data'!B2","v":"Part Size"}]
["Thin or thick end?",{"$f":"'Config. Data'!B9","v":"Minimum Thickness (mm)"}]
["May I ask?",{"$f":"'Config. Data'!B12","v":"Weight (gr)"}]
["Number of faces of the product",{"$f":"'Config. Data'!B15","v":"Number of Stable States"}]
["Average pickable parts per minute",{"$f":"'Config. Data'!B19","v":"Average PPM (parts per min)"}]
["Heavy burden?",{"$f":"'Config. Data'!B23","v":"Metal Part"}]
["We can feed anything",{"$f":"'Config. Data'!B26","v":"Part Geometry"}]
["Superficial characteristic",{"$f":"'Config. Data'!B33","v":"Part Feature"}]
["110 or 220?",{"$f":"'Config. Data'!B38","v":"Power Supply"}]
{"$rows_left_out":21}
{"sheet":"Simulation","index":1,"n_rows":30,"n_cols":2,"rows_kept":30,"cut":false,"hidden":false,"merged":[[1,1,1,10]]}
[]
[null,"Products Simulation (the yellow line is the Footprint)"]
[]
[null,"Size: 1600 (L=80, l=20)"]
[null,"Min Thickness: >2,5 mm"]
[null,"Number of Stable States: 1"]
[null,"Metal Parts: No"]
[null,"Geometry: Cylindrical > 20 mm"]
[]
[]
[null,"Size: 1750 (L=70, l=25)"]
[null,"Min Thickness: >2,5 mm"]
[null,"Number of Stable States: 2"]
[null,"Metal Parts: Yes"]
[null,"Geometry: Flat"]
[]
[]
[null,"Size: 1500 (L=60, l=25)"]
[null,"Min Thickness: <=2,5 mm"]
[null,"Number of Stable States: >3"]
{"$rows_left_out":11}
{"sheet":"Price List","index":2,"n_rows":195,"n_cols":4,"rows_kept":195,"cut":false,"hidden":true,"merged":[]}
[]
[null,null,"GM000392.00","FlexiBowl 200C/E"]
[null,null,"GM000399.00","FlexiBowl 200CC/E"]
[null,null,"GM000019.00","FlexiBowl 350C/E"]
[null,null,"GM000370.00","FlexiBowl 350CC/E"]
[null,null,"GM000020.00","FlexiBowl 500C"]
[null,null,"GM000021.00","FlexiBowl 500CC"]
[null,null,"GM000217.00","FlexiBowl 500C/E"]
[null,null,"GM000218.00","FlexiBowl 500CC/E"]
[null,null,"GM000215.00","FlexiBowl 650C"]
[null,null,"GM000216.00","FlexiBowl 650CC"]
[null,null,"GM000117.00","FlexiBowl 800C"]
[null,null,"GM000118.00","FlexiBowl 800CC"]
[]
[null,null,"PC000001.00","FlexiVision 200/350 Bundle "]
[null,null,"PC000002.00","FlexiVision 200/350 Bundle IR "]
[null,null,"PC000003.00","FlexiVision 500 Bundle"]
[null,null,"PC000004.00","FlexiVision 500 Bundle IR"]
[null,null,"PC000005.00","FlexiVision 650/800 Bundle"]
[null,null,"PC000006.00","FlexiVision 650/800 Bundle IR"]
{"$rows_left_out":176}
{"sheet":"Config. Data","index":3,"n_rows":50,"n_cols":5,"rows_kept":50,"cut":false,"hidden":true,"merged":[]}
[]
[null,"Part Size","<= 180mm^2 and L<= 10mm",null,"Rotary Disc Diamond Blue FDA"]
[null,null,"<= 354mm^2 and L<= 20mm",null,"Rotary Disc Spike Beige FDA"]
[null,null,"<= 950mm^2 and L<= 50mm",null,"Rotary Disc Flat Beige FDA"]
[null,null,"<= 1800mm^2 and L<= 110mm",null,"Rotary Disc Polibech White FDA"]
[null,null,"<= 2366mm^2 and L<= 250mm",null,"Rotary Disc Diamond White FDA"]
[null,null,"> 2366mm^2 or L> 250mm",null,"Rotary Disc Spike Transparent FDA"]
[null,null,null,null,"Rotary Disc Silicon Transparent FDA"]
[null,"Minimum Thickness (mm)","<=2,5",null,"Rotary Disc Standard Transparent FDA"]
[null,null,">2,5",null,"Air Blow"]
[null,null,null,null,"Brush Diverter"]
[null,"Weight (gr)","<=15",null,"Wedge Diverter"]
[null,null,">15",null,"Standard Diverter Included"]
[null,null,null,null,"Rotary Disc Standard Transparent Included"]
[null,"Number of Stable States","1"]
[null,null,"2",null,"Select Size, Weight And Thickness"]
[null,null,">=3",null,"Select Size, Weight, Thickness and Light Color"]
[null,null,null,null,"Check Characteristic Section"]
[null,"Average PPM (parts per min)","<=25",null,"Select Size, Weight, Thickness, Metal, Geometry and Feature"]
[null,null,"25< x <=50",null,"Select Size, Weight, Tickness and Power Supply"]
{"$rows_left_out":31}
{"sheet":"Tabella","index":4,"n_rows":27,"n_cols":21,"rows_kept":27,"cut":false,"hidden":true,"merged":[[9,1,9,7]]}
[null," "]
[null,null,"FlexiBowl","Backlight IR","Backlight White","Backlight Red","Bulk Feeders 220V","Bulk Feeders 110V","Bulk Feeders 220V Poly","Bulk Feeders 110V Poly",{"$f":"'Config. Data'!E2","v":"Rotary Disc Diamond Blue FDA"},{"$f":"'Config. Data'!E3","v":"Rotary Disc Spike Beige FDA"},{"$f":"'Config. Data'!E4","v":"Rotary Disc Flat Beige FDA"},{"$f":"'Config. Data'!E5","v":"Rotary Disc Polibech White FDA"},{"$f":"'Config. Data'!E6","v":"Rotary Disc Diamond White FDA"},{"$f":"'Config. Data'!E7","v":"Rotary Disc Spike Transparent FDA"},{"$f":"'Config. Data'!E8","v":"Rotary Disc Silicon Transparent FDA"},{"$f":"'Config. Data'!E9","v":"Rotary Disc Standard Transparent FDA"},{"$f":"'Config. Data'!E12","v":"Wedge Diverter"},{"$f":"'Config. Data'!E10","v":"Air Blow"},"Quick Emptying"]
[null,"FlexiBowl 200","GM000392.00","CE000278.00","CE000331.00","CE000351.00","GM000447.00","GM000452.00","GM000447.00","GM000452.00","GM000414.00","GM000407.00","GM000457.00","GM000413.00","GM000458.00","GM000407.00","GM000404.00",{"$f":"'Config. Data'!E14","v":"Rotary Disc Standard Transparent Included"},"GM000282.00","GM000371.00",{"$f":"'Config. Data'!E22","v":"Not Available for this Model"}]
[null,"FlexiBowl 350","GM000019.00","CE000275.00","CE000341.00","CE000342.00","GM000268.00","GM000300.00","GM000343.00","GM000344.00","GM000420.00","GM000418.00","GM000459.00","GM000421.00","GM000460.00","GM000418.00","GM000416.00",{"$f":"'Config. Data'!E14","v":"Rotary Disc Standard Transparent Included"},"GM000282.00","GM000371.00",{"$f":"'Config. Data'!E22","v":"Not Available for this Model"}]
[null,"FlexiBowl 500","GM000020.00","CE000272.00","CE000343.00","CE000344.00","GM000266.00","GM000299.00","GM000341.00","GM000344.00","PD000171.00","PD000172.00","PD001056.00","PD001251.00","PD000177.00","PD000178.00","PD000179.00",{"$f":"'Config. Data'!E14","v":"Rotary Disc Standard Transparent Included"},"GM000454.00","GM000282.00","GM000443.00"]
[null,"FlexiBowl 500/E","GM000217.00","CE000272.00","CE000343.00","CE000344.00","GM000266.00","GM000299.00","GM000341.00","GM000342.00","GM000435.00","GM000438.00","GM000461.00","GM000436.00","GM000462.00","GM000438.00","GM000437.00",{"$f":"'Config. Data'!E14","v":"Rotary Disc Standard Transparent Included"},"GM000282.00","GM000371.00",{"$f":"'Config. Data'!E22","v":"Not Available for this Model"}]
[null,"FlexiBowl 650","GM000215.00","CE000273.00","CE000305.00","CE000306.00","GM000290.00","GM000301.00","GM000339.00","GM000340.00","PD000154.00","PD000155.00","PD001004.00","PD001252.00","PD000160.00","PD000161.00","PD000162.00",{"$f":"'Config. Data'!E14","v":"Rotary Disc Standard Transparent Included"},"GM000455.00","GM000282.00","GM000445.00"]
[null,"FlexiBowl 800","GM000117.00","CE000274.00","CE000346.00","CE000345.00","GM000298.00","GM000302.00","GM000345.00","GM000346.00","PD000141.00","PD000142.00","PD001209.00","PD001253.00","PD000146.00","PD000147.00","PD000148.00",{"$f":"'Config. Data'!E14","v":"Rotary Disc Standard Transparent Included"},"GM000456.00","GM000282.00","GM000441.00"]
[]
[null,"LOGICA "]
[null,null,null,null,null,null,null,null,null,null,null,"CE000106.00","IR Flat Dome 5030"]
["METALLO",{"$f":"'Config. Data'!C23","v":"No"},{"$f":"'Config. Data'!C26","v":"Flat"},{"$f":"'Config. Data'!C27","v":"Cylindrical (d>=20mm)"},{"$f":"'Config. Data'!C28","v":"Cylindrical (10<=dia<20mm)"},{"$f":"'Config. Data'!C29","v":"Cylindrical (5<=dia<10mm)"},{"$f":"'Config. Data'!C30","v":"Cylindrical (1<=dia<5mm)"},{"$f":"'Config. Data'!C31","v":"Complex"},null,{"$f":"IF(AND(QQT!C17=Tabella!B12,QQT!C18=Tabella!C12,QQT!C19=Tabella!B13),Tabella!C13,IF(AND(QQT!C17=Tabella!B12,QQT!C18=Tabella!C12,QQT!C19=Tabella!B14),Tabella!C14,IF(AND(QQT!C17=Tabella!B12,QQT!C18=Tabella!C12,QQT!C19=Tabella!B15),Tabella!C15,IF(AND(QQT!C17=Tabella!B12,QQT!C18=Tabella!C12,QQT!C19=Tabella!B16),Tabella!C16,IF(AND(QQT!C17=Tabella!B12,QQT!C18=Tabella!D12,QQT!C19=Tabella!B13),Tabella!D13,IF(AND(QQT!C17=Tabella!B12,QQT!C18=Tabella!D12,QQT!C19=Tabella!B14),Tabella!D14,IF(AND(QQT!C17=Tabella!B12,QQT!C18=Tabella!D12,QQT!C19=Tabella!B15),Tabella!D15,IF(AND(QQT!C17=Tabella!B12,QQT!C18=Tabella!D12,QQT!C19=Tabella!B16),Tabella!D16,IF(AND(QQT!C17=Tabella!B12,QQT!C18=Tabella!E12,QQT!C19=Tabella!B13),Tabella!E13,IF(AND(QQT!C17=Tabella!B12,QQT!C18=Tabella!E12,QQT!C19=Tabella!B14),Tabella!E14,IF(AND(QQT!C17=Tabella!B12,QQT!C18=Tabella!E12,QQT!C19=Tabella!B15),Tabella!E15,IF(AND(QQT!C17=Tabella!B12,QQT!C18=Tabella!E12,QQT!C19=Tabella!B16),Tabella!E16,IF(AND(QQT!C17=Tabella!B12,QQT!C18=Tabella!F12,QQT!C19=Tabella!B13),Tabella!F13,IF(AND(QQT!C17=Tabella!B12,QQT!C18=Tabella!F12,QQT!C19=Tabella!B14),Tabella!F14,IF(AND(QQT!C17=Tabella!B12,QQT!C18=Tabella!F12,QQT!C19=Tabella!B15),Tabella!F15,IF(AND(QQT!C17=Tabella!B12,QQT!C18=Tabella!F12,QQT!C19=Tabella!B16),Tabella!F16,IF(AND(QQT!C17=Tabella!B12,QQT!C1=Tabella!G12,QQT!C19=Tabella!B13),Tabella!G13,IF(AND(QQT!C17=Tabella!B12,QQT!C18=Tabella!G12,QQT!C19=Tabella!B14),Tabella!G14,IF(AND(QQT!C17=Tabella!B12,QQT!C18=Tabella!G12,QQT!C19=Tabella!B15),Tabella!G15,IF(AND(QQT!C17=Tabella!B12,QQT!C18=Tabella!G12,QQT!C19=Tabella!B16),Tabella!G16,IF(AND(QQT!C17=Tabella!B12,QQT!C18=Tabella!H12,QQT!C19=Tabella!B13),Tabella!H13,IF(AND(QQT!C17=Tabella!B12,QQT!C18=Tabella!H12,QQT!C19=Tabella!B14),Tabella!H14,IF(AND(QQT!C17=Tabella!B12,QQT!C18=Tabella!H12,QQT!C19=Tabella!B15),Tabella!H15,IF(AND(QQT!C17=Tabella!B12,QQT!C18=Tabella!H12,QQT!C19=Tabella!B16),Tabella!H16,IF(AND(QQT!C17=Tabella!B18,QQT!C18=Tabella!C18,QQT!C19=Tabella!B19),Tabella!C19,IF(AND(QQT!C17=Tabella!B18,QQT!C18=Tabella!C18,QQT!C19=Tabella!B20),Tabella!C20,IF(AND(QQT!C17=Tabella!B18,QQT!C18=Tabella!C18,QQT!C19=Tabella!B21),Tabella!C21,IF(AND(QQT!C17=Tabella!B18,QQT!C18=Tabella!C18,QQT!C19=Tabella!B22),Tabella!C22,IF(AND(QQT!C17=Tabella!B18,QQT!C18=Tabella!D18,QQT!C19=Tabella!B19),Tabella!D19,IF(AND(QQT!C17=Tabella!B18,QQT!C18=Tabella!D18,QQT!C19=Tabella!B20),Tabella!D20,IF(AND(QQT!C17=Tabella!B18,QQT!C18=Tabella!D18,QQT!C19=Tabella!B21),Tabella!D21,IF(AND(QQT!C17=Tabella!B18,QQT!C18=Tabella!D18,QQT!C19=Tabella!B22),Tabella!D22,IF(AND(QQT!C17=Tabella!B18,QQT!C18=Tabella!E18,QQT!C19=Tabella!B19),Tabella!E19,IF(AND(QQT!C17=Tabella!B18,QQT!C18=Tabella!E18,QQT!C19=Tabella!B20),Tabella!E20,IF(AND(QQT!C17=Tabella!B18,QQT!C18=Tabella!E18,QQT!C19=Tabella!B21),Tabella!E21,IF(AND(QQT!C17=Tabella!B18,QQT!C18=Tabella!E18,QQT!C19=Tabella!B22),Tabella!E22,IF(AND(QQT!C17=Tabella!B18,QQT!C18=Tabella!F18,QQT!C19=Tabella!B19),Tabella!F19,IF(AND(QQT!C17=Tabella!B18,QQT!C18=Tabella!F18,QQT!C19=Tabella!B20),Tabella!F20,IF(AND(QQT!C17=Tabella!B18,QQT!C18=Tabella!F18,QQT!C19=Tabella!B21),Tabella!F21,IF(AND(QQT!C17=Tabella!B18,QQT!C18=Tabella!F18,QQT!C19=Tabella!B22),Tabella!F22,IF(AND(QQT!C17=Tabella!B18,QQT!C18=Tabella!G18,QQT!C19=Tabella!B19),Tabella!G19,IF(AND(QQT!C17=Tabella!B18,QQT!C18=Tabella!G18,QQT!C19=Tabella!B20),Tabella!G20,IF(AND(QQT!C17=Tabella!B18,QQT!C18=Tabella!G18,QQT!C19=Tabella!B21),Tabella!G21,IF(AND(QQT!C17=Tabella!B18,QQT!C18=Tabella!G18,QQT!C19=Tabella!B22),Tabella!G22,IF(AND(QQT!C17=Tabella!B18,QQT!C18=Tabella!H18,QQT!C19=Tabella!B19),Tabella!H19,IF(AND(QQT!C17=Tabella!B18,QQT!C18=Tabella!H18,QQT!C19=Tabella!B20),Tabella!H20,IF(AND(QQT!C17=Tabella!B18,QQT!C18=Tabella!H18,QQT!C19=Tabella!B21),Tabella!H21,IF(AND(QQT!C17=Tabella!B18,QQT!C18=Tabella!H18,QQT!C19=Tabella!B22),Tabella!H22,'Config. Data'!E19))))))))))))))))))))))))))))))))))))))))))))))))","v":"Select Size, Weight, Thickness, Metal, Geometry and Feature"},null,"CE000104.00","White Flat Dome 5030"]
[null,{"$f":"'Config. Data'!C33","v":"None of Them"},{"$f":"'Config. Data'!$E$9","v":"Rotary Disc Standard Transparent FDA"},{"$f":"'Config. Data'!$E$3","v":"Rotary Disc Spike Beige FDA"},{"$f":"'Config. Data'!$E$7","v":"Rotary Disc Spike Transparent FDA"},{"$f":"'Config. Data'!$E$5","v":"Rotary Disc Polibech White FDA"},{"$f":"'Config. Data'!$E$2","v":"Rotary Disc Diamond Blue FDA"},{"$f":"'Config. Data'!$E$9","v":"Rotary Disc Standard Transparent FDA"},null,null,null,"CE000105.00","Red Flat Dome 5030"]
[null,{"$f":"'Config. Data'!C34","v":"Sticky/Tangly"},{"$f":"'Config. Data'!$E$2","v":"Rotary Disc Diamond Blue FDA"},{"$f":"'Config. Data'!$E$3","v":"Rotary Disc Spike Beige FDA"},{"$f":"'Config. Data'!$E$7","v":"Rotary Disc Spike Transparent FDA"},{"$f":"'Config. Data'!$E$5","v":"Rotary Disc Polibech White FDA"},{"$f":"'Config. Data'!$E$2","v":"Rotary Disc Diamond Blue FDA"},{"$f":"'Config. Data'!$E$2","v":"Rotary Disc Diamond Blue FDA"}]
[null,{"$f":"'Config. Data'!C35","v":"Dirty/Oily"},{"$f":"'Config. Data'!$E$2","v":"Rotary Disc Diamond Blue FDA"},{"$f":"'Config. Data'!$E$3","v":"Rotary Disc Spike Beige FDA"},{"$f":"'Config. Data'!$E$7","v":"Rotary Disc Spike Transparent FDA"},{"$f":"'Config. Data'!$E$5","v":"Rotary Disc Polibech White FDA"},{"$f":"'Config. Data'!$E$2","v":"Rotary Disc Diamond Blue FDA"},{"$f":"'Config. Data'!$E$2","v":"Rotary Disc Diamond Blue FDA"}]
[null,{"$f":"'Config. Data'!C36","v":"Transparent"},{"$f":"'Config. Data'!$E$4","v":"Rotary Disc Flat Beige FDA"},{"$f":"'Config. Data'!$E$8","v":"Rotary Disc Silicon Transparent FDA"},{"$f":"'Config. Data'!$E$8","v":"Rotary Disc Silicon Transparent FDA"},{"$f":"'Config. Data'!$E$8","v":"Rotary Disc Silicon Transparent FDA"},{"$f":"'Config. Data'!$E$6","v":"Rotary Disc Diamond White FDA"},{"$f":"'Config. Data'!$E$4","v":"Rotary Disc Flat Beige FDA"}]
[]
["METALLO",{"$f":"'Config. Data'!C24","v":"Yes"},"Flat",{"$f":"'Config. Data'!C27","v":"Cylindrical (d>=20mm)"},{"$f":"'Config. Data'!C28","v":"Cylindrical (10<=dia<20mm)"},{"$f":"'Config. Data'!C29","v":"Cylindrical (5<=dia<10mm)"},{"$f":"'Config. Data'!C30","v":"Cylindrical (1<=dia<5mm)"},{"$f":"'Config. Data'!C31","v":"Complex"}]
[null,{"$f":"'Config. Data'!C33","v":"None of Them"},{"$f":"'Config. Data'!$E$2","v":"Rotary Disc Diamond Blue FDA"},{"$f":"'Config. Data'!$E$3","v":"Rotary Disc Spike Beige FDA"},{"$f":"'Config. Data'!$E$7","v":"Rotary Disc Spike Transparent FDA"},{"$f":"'Config. Data'!$E$5","v":"Rotary Disc Polibech White FDA"},{"$f":"'Config. Data'!$E$2","v":"Rotary Disc Diamond Blue FDA"},{"$f":"'Config. Data'!$E$2","v":"Rotary Disc Diamond Blue FDA"}]
[null,{"$f":"'Config. Data'!C34","v":"Sticky/Tangly"},{"$f":"'Config. Data'!$E$2","v":"Rotary Disc Diamond Blue FDA"},{"$f":"'Config. Data'!$E$3","v":"Rotary Disc Spike Beige FDA"},{"$f":"'Config. Data'!$E$7","v":"Rotary Disc Spike Transparent FDA"},{"$f":"'Config. Data'!$E$5","v":"Rotary Disc Polibech White FDA"},{"$f":"'Config. Data'!$E$2","v":"Rotary Disc Diamond Blue FDA"},{"$f":"'Config. Data'!$E$2","v":"Rotary Disc Diamond Blue FDA"}]
{"$rows_left_out":7}